Reaction Details
TargetProgesterone receptor
LigandBDBM50072000
Substrate/Competitorn/a
Meas. Tech.ChEBML_159728
Ki 101±n/a nM
Citation Hamann, LGWinn, DTPooley, CLTegley, CMWest, SJFarmer, LJZhi, LEdwards, JPMarschke, KBMais, DEGoldman, MEJones, TK Nonsteroidal progesterone receptor antagonists based on a conformationally-restricted subseries of 6-aryl-1,2-dihydro-2,2,4-trimethylquinolines. Bioorg Med Chem Lett8:2731-6 (1999) Progesterone receptor
Name:Progesterone receptor
Type:Protein
Mol. Mass.:98979.52
Organism:Homo sapiens (Human)
Description:P06401
Residue:933
BDBM50072000
NameBDBM50072000
Synonyms:8-Fluoro-2,2,4-trimethyl-2,10-dihydro-1H-indeno[1,2-g]quinolin-10-ol | CHEMBL93451
TypeSmall organic molecule
Emp. Form.C19H18FNO
Mol. Mass.295.3507
SMILESCC1=CC(C)(C)Nc2cc3C(O)c4cc(F)ccc4-c3cc12