Reaction Details
TargetProgesterone receptor
LigandBDBM50072004
Substrate/Competitorn/a
Meas. Tech.ChEMBL_159728 (CHEMBL766185)
Ki 24±n/a nM
Citation Hamann, LGWinn, DTPooley, CLTegley, CMWest, SJFarmer, LJZhi, LEdwards, JPMarschke, KBMais, DEGoldman, MEJones, TK Nonsteroidal progesterone receptor antagonists based on a conformationally-restricted subseries of 6-aryl-1,2-dihydro-2,2,4-trimethylquinolines. Bioorg Med Chem Lett8:2731-6 (1999) Progesterone receptor
Name:Progesterone receptor
Type:Protein
Mol. Mass.:98979.52
Organism:Homo sapiens (Human)
Description:P06401
Residue:933
BDBM50072004
NameBDBM50072004
Synonyms:8-bromo-2,2,4-trimethyl-2,10-dihydro-1H-indeno[1,2-g]quinoline | CHEMBL446418
TypeSmall organic molecule
Emp. Form.C19H18BrN
Mol. Mass.340.257
SMILESCC1=CC(C)(C)Nc2cc3Cc4cc(Br)ccc4-c3cc12