Reaction Details
TargetProgesterone receptor
LigandBDBM50071987
Substrate/Competitorn/a
Meas. Tech.ChEBML_159728
Ki>10000±n/a nM
Citation Hamann, LGWinn, DTPooley, CLTegley, CMWest, SJFarmer, LJZhi, LEdwards, JPMarschke, KBMais, DEGoldman, MEJones, TK Nonsteroidal progesterone receptor antagonists based on a conformationally-restricted subseries of 6-aryl-1,2-dihydro-2,2,4-trimethylquinolines. Bioorg Med Chem Lett8:2731-6 (1999) Progesterone receptor
Name:Progesterone receptor
Type:Protein
Mol. Mass.:98979.52
Organism:Homo sapiens (Human)
Description:P06401
Residue:933
BDBM50071987
NameBDBM50071987
Synonyms:10-Benzyl-8-bromo-2,2,4-trimethyl-2,10-dihydro-1H-indeno[1,2-g]quinoline | CHEMBL93474
TypeSmall organic molecule
Emp. Form.C26H24BrN
Mol. Mass.430.379
SMILESCC1=CC(C)(C)Nc2cc3C(Cc4ccccc4)c4cc(Br)ccc4-c3cc12