Reaction Details
TargetCaspase-1
LigandBDBM50072047
Substrate/Competitorn/a
Meas. Tech.ChEBML_46514
IC50 1.20±n/a nM
Citation Karanewsky, DSBai, XLinton, SDKrebs, JFWu, JPham, BTomaselli, KJ Conformationally constrained inhibitors of caspase-1 (interleukin-1 beta converting enzyme) and of the human CED-3 homologue caspase-3 (CPP32, apopain). Bioorg Med Chem Lett8:2757-62 (1999) Caspase-1
Name:Caspase-1
Type:PROTEIN
Mol. Mass.:45636.44
Organism:Mus musculus
Description:ChEMBL_651546
Residue:402
BDBM50072047
NameBDBM50072047
Synonyms:4-(2-Acetylamino-3-carboxy-propionylamino)-4-[1-((S)-2-hydroxy-5-oxo-tetrahydro-furan-3-ylcarbamoyl)-2-methyl-propylcarbamoyl]-butyric acid | CHEMBL430648
TypeSmall organic molecule
Emp. Form.C20H30N4O11
Mol. Mass.502.4724
SMILESCC(C)[C@H](NC(=O)[C@H](CCC(O)=O)NC(=O)[C@H](CC(O)=O)NC(C)=O)C(=O)N[C@H]1CC(=O)OC1O