Reaction Details
TargetCaspase-1
LigandBDBM50072053
Substrate/Competitorn/a
Meas. Tech.ChEBML_46514
IC50 15000±n/a nM
Citation Karanewsky, DSBai, XLinton, SDKrebs, JFWu, JPham, BTomaselli, KJ Conformationally constrained inhibitors of caspase-1 (interleukin-1 beta converting enzyme) and of the human CED-3 homologue caspase-3 (CPP32, apopain). Bioorg Med Chem Lett8:2757-62 (1999) Caspase-1
Name:Caspase-1
Type:PROTEIN
Mol. Mass.:45636.44
Organism:Mus musculus
Description:ChEMBL_651546
Residue:402
BDBM50072053
NameBDBM50072053
Synonyms:(S)-2-[2-Acetylamino-3-(4-hydroxy-phenyl)-propionylamino]-N-[(S)-1-((S)-2-hydroxy-5-oxo-tetrahydro-furan-3-ylcarbamoyl)-ethyl]-3-methyl-butyramide | CHEMBL2370217
TypeSmall organic molecule
Emp. Form.C23H32N4O8
Mol. Mass.492.5222
SMILESCC(C)[C@H](NC(=O)[C@H](Cc1ccc(O)cc1)NC(C)=O)C(=O)N[C@@H](C)C(=O)N[C@H]1CC(=O)OC1O