Reaction Details
TargetCaspase-1
LigandBDBM50072052
Substrate/Competitorn/a
Meas. Tech.ChEBML_46514
IC50 37000±n/a nM
Citation Karanewsky, DSBai, XLinton, SDKrebs, JFWu, JPham, BTomaselli, KJ Conformationally constrained inhibitors of caspase-1 (interleukin-1 beta converting enzyme) and of the human CED-3 homologue caspase-3 (CPP32, apopain). Bioorg Med Chem Lett8:2757-62 (1999) Caspase-1
Name:Caspase-1
Type:PROTEIN
Mol. Mass.:45636.44
Organism:Mus musculus
Description:ChEMBL_651546
Residue:402
BDBM50072052
NameBDBM50072052
Synonyms:CHEMBL96496 | {(S)-1-[((S)-2-Hydroxy-5-oxo-tetrahydro-furan-3-ylcarbamoyl)-methyl]-2-oxo-piperidin-3-yl}-carbamic acid benzyl ester
TypeSmall organic molecule
Emp. Form.C19H23N3O7
Mol. Mass.405.4018
SMILESOC1OC(=O)C[C@@H]1NC(=O)CN1CCC[C@H](NC(=O)OCc2ccccc2)C1=O