Reaction Details
TargetcAMP-specific 3',5'-cyclic phosphodiesterase 4D
LigandBDBM50072200
Substrate/Competitorn/a
Meas. Tech.ChEBML_155178
IC50 130±n/a nM
Citation Charpiot, BBrun, JDonze, INaef, RStefani, MMueller, T Quinazolines: combined type 3 and 4 phosphodiesterase inhibitors. Bioorg Med Chem Lett8:2891-6 (1999) cAMP-specific 3',5'-cyclic phosphodiesterase 4D
Name:cAMP-specific 3',5'-cyclic phosphodiesterase 4D
Type:Protein
Mol. Mass.:91092.69
Organism:Homo sapiens (Human)
Description:Q08499
Residue:809
BDBM50072200
NameBDBM50072200
Synonyms:3-[4-(3,5-Bis-cyclopropylmethoxy-phenyl)-7-(2-hydroxy-ethoxy)-6-methoxy-quinazolin-2-yloxy]-propan-1-ol | CHEMBL96039
TypeSmall organic molecule
Emp. Form.C28H34N2O7
Mol. Mass.510.5788
SMILESCOc1cc2c(nc(OCCCO)nc2cc1OCCO)-c1cc(OCC2CC2)cc(OCC2CC2)c1