Reaction Details
TargetcAMP-specific 3',5'-cyclic phosphodiesterase 4D
LigandBDBM50072194
Substrate/Competitorn/a
Meas. Tech.ChEBML_155178
IC50 300±n/a nM
Citation Charpiot, BBrun, JDonze, INaef, RStefani, MMueller, T Quinazolines: combined type 3 and 4 phosphodiesterase inhibitors. Bioorg Med Chem Lett8:2891-6 (1999) cAMP-specific 3',5'-cyclic phosphodiesterase 4D
Name:cAMP-specific 3',5'-cyclic phosphodiesterase 4D
Type:Protein
Mol. Mass.:91092.69
Organism:Homo sapiens (Human)
Description:Q08499
Residue:809
BDBM50072194
NameBDBM50072194
Synonyms:2-[4-(3,5-Bis-cyclopropylmethoxy-phenyl)-2-butyl-6-methoxy-quinazolin-7-yloxy]-ethanol | CHEMBL418785
TypeSmall organic molecule
Emp. Form.C29H36N2O5
Mol. Mass.492.6065
SMILESCCCCc1nc(-c2cc(OCC3CC3)cc(OCC3CC3)c2)c2cc(OC)c(OCCO)cc2n1