Reaction Details
TargetcAMP-specific 3',5'-cyclic phosphodiesterase 4B
LigandBDBM50072199
Substrate/Competitorn/a
Meas. Tech.ChEBML_155172
IC50 110±n/a nM
Citation Charpiot, BBrun, JDonze, INaef, RStefani, MMueller, T Quinazolines: combined type 3 and 4 phosphodiesterase inhibitors. Bioorg Med Chem Lett8:2891-6 (1999) cAMP-specific 3',5'-cyclic phosphodiesterase 4B
Name:cAMP-specific 3',5'-cyclic phosphodiesterase 4B
Type:Enzyme Catalytic Domain
Mol. Mass.:83349.50
Organism:RAT
Description:P14646
Residue:736
BDBM50072199
NameBDBM50072199
Synonyms:2-[4-(3,5-Bis-cyclopropylmethoxy-phenyl)-2,6-dimethoxy-quinazolin-7-yloxy]-ethanol | CHEMBL420454
TypeSmall organic molecule
Emp. Form.C26H30N2O6
Mol. Mass.466.5262
SMILESCOc1nc(-c2cc(OCC3CC3)cc(OCC3CC3)c2)c2cc(OC)c(OCCO)cc2n1