Reaction Details
TargetcAMP-specific 3',5'-cyclic phosphodiesterase 4A/4B/4C/4D
LigandBDBM50072197
Substrate/Competitorn/a
Meas. Tech.ChEMBL_157218 (CHEMBL769542)
IC50 15±n/a nM
Citation Charpiot, BBrun, JDonze, INaef, RStefani, MMueller, T Quinazolines: combined type 3 and 4 phosphodiesterase inhibitors. Bioorg Med Chem Lett8:2891-6 (1999) cAMP-specific 3',5'-cyclic phosphodiesterase 4A/4B/4C/4D
Name:cAMP-specific 3',5'-cyclic phosphodiesterase 4A/4B/4C/4D
Synonyms:Phosphodiesterase 4
Type:n/a
Mol. Mass.:n/a
Description:ASSAY_ID of ChEMBL is 193660
Components:This complex has 4 components.
Component 1
Name:cAMP-specific 3',5'-cyclic phosphodiesterase 4B
Type:Enzyme Catalytic Domain
Mol. Mass.:83349.50
Organism:RAT
Description:P14646
Residue:736
Component 2
Name:cAMP-specific 3',5'-cyclic phosphodiesterase 4D
Synonyms:DPDE3 Pde4d
Type:PROTEIN
Mol. Mass.:90531.57
Organism:Rattus norvegicus
Description:ChEMBL_104732
Residue:803
Component 3
Name:cAMP-specific 3',5'-cyclic phosphodiesterase 4A
Synonyms:DPDE2 Pde4a
Type:PROTEIN
Mol. Mass.:93412.58
Organism:Rattus norvegicus
Description:ChEMBL_104732
Residue:844
Component 4
Name:cAMP-specific 3',5'-cyclic phosphodiesterase 4C
Synonyms:Dpde1 Pde4c
Type:PROTEIN
Mol. Mass.:60038.21
Organism:Rattus norvegicus
Description:ChEMBL_104732
Residue:536
BDBM50072197
NameBDBM50072197
Synonyms:2-[4-(3,5-Bis-cyclopropylmethoxy-phenyl)-2-ethyl-6-methoxy-quinazolin-7-yloxy]-ethanol | CHEMBL97817
TypeSmall organic molecule
Emp. Form.C27H32N2O5
Mol. Mass.464.5534
SMILESCCc1nc(-c2cc(OCC3CC3)cc(OCC3CC3)c2)c2cc(OC)c(OCCO)cc2n1