Reaction Details
TargetcAMP-specific 3',5'-cyclic phosphodiesterase 4A/4B/4C/4D
LigandBDBM50072200
Substrate/Competitorn/a
Meas. Tech.ChEMBL_157218 (CHEMBL769542)
IC50 145±n/a nM
Citation Charpiot, BBrun, JDonze, INaef, RStefani, MMueller, T Quinazolines: combined type 3 and 4 phosphodiesterase inhibitors. Bioorg Med Chem Lett8:2891-6 (1999) cAMP-specific 3',5'-cyclic phosphodiesterase 4A/4B/4C/4D
Name:cAMP-specific 3',5'-cyclic phosphodiesterase 4A/4B/4C/4D
Synonyms:Phosphodiesterase 4
Type:n/a
Mol. Mass.:n/a
Description:ASSAY_ID of ChEMBL is 193660
Components:This complex has 4 components.
Component 1
Name:cAMP-specific 3',5'-cyclic phosphodiesterase 4B
Type:Enzyme Catalytic Domain
Mol. Mass.:83349.50
Organism:RAT
Description:P14646
Residue:736
Component 2
Name:cAMP-specific 3',5'-cyclic phosphodiesterase 4D
Synonyms:DPDE3 Pde4d
Type:PROTEIN
Mol. Mass.:90531.57
Organism:Rattus norvegicus
Description:ChEMBL_104732
Residue:803
Component 3
Name:cAMP-specific 3',5'-cyclic phosphodiesterase 4A
Synonyms:DPDE2 Pde4a
Type:PROTEIN
Mol. Mass.:93412.58
Organism:Rattus norvegicus
Description:ChEMBL_104732
Residue:844
Component 4
Name:cAMP-specific 3',5'-cyclic phosphodiesterase 4C
Synonyms:Dpde1 Pde4c
Type:PROTEIN
Mol. Mass.:60038.21
Organism:Rattus norvegicus
Description:ChEMBL_104732
Residue:536
BDBM50072200
NameBDBM50072200
Synonyms:3-[4-(3,5-Bis-cyclopropylmethoxy-phenyl)-7-(2-hydroxy-ethoxy)-6-methoxy-quinazolin-2-yloxy]-propan-1-ol | CHEMBL96039
TypeSmall organic molecule
Emp. Form.C28H34N2O7
Mol. Mass.510.5788
SMILESCOc1cc2c(nc(OCCCO)nc2cc1OCCO)-c1cc(OCC2CC2)cc(OCC2CC2)c1