Reaction Details
TargetSerine protease 1
LigandBDBM50072283
Substrate/Competitorn/a
Meas. Tech.ChEBML_212695
IC50 0.600000±n/a nM
Citation Finch, HPegg, NAMcLaren, JLowdon, ABolton, RCoote, SJDyer, UMontana, JGOwen, MRDowle, MBuckley, DRoss, BCCampbell, CDix, CMooney, CMan-Tang, CPatel, C 5,5-trans lactone-containing inhibitors of serine proteases: identification of a novel, acylating thrombin inhibitor. Bioorg Med Chem Lett8:2955-60 (1999) 
 
Serine protease 1
Name:Serine protease 1
Type:Enzyme
Mol. Mass.:26557.80
Organism:Homo sapiens (Human)
Description:P07477
Residue:247
BDBM50072283
NameBDBM50072283
Synonyms:(3S,3aR,6aS)-3-Benzyl-hexahydro-cyclopenta[b]furan-2-one | CHEMBL101030
TypeSmall organic molecule
Emp. Form.C14H16O2
Mol. Mass.216.2756
SMILESO=C1O[C@H]2CCC[C@@H]2[C@@H]1Cc1ccccc1