Reaction Details
TargetOxytocin receptor
LigandBDBM50072369
Substrate/Competitorn/a
Meas. Tech.ChEBML_149050
Ki 2±n/a nM
Citation Kuo, MSBock, MGFreidinger, RMGuidotti, MTLis, EVPawluczyk, JMPerlow, DSPettibone, DJQuigley, AGReiss, DRWilliams, PDWoyden, CJ Nonpeptide oxytocin antagonists: potent, orally bioavailable analogs of L-371,257 containing a 1-R-(pyridyl)ethyl ether terminus. Bioorg Med Chem Lett8:3081-6 (1999) 
 
Oxytocin receptor
Name:Oxytocin receptor
Type:Enzyme Catalytic Domain
Mol. Mass.:42793.26
Organism:Homo sapiens (Human)
Description:Oxytocin OXTR HEK293::B2R9L7
Residue:389
BDBM50072369
NameBDBM50072369
Synonyms:1-{1-[5-Fluoro-2-methoxy-4-((R)-1-pyridin-4-yl-ethoxy)-benzoyl]-piperidin-4-yl}-1,4-dihydro-benzo[d][1,3]oxazin-2-one | CHEMBL104237
TypeSmall organic molecule
Emp. Form.C28H28FN3O5
Mol. Mass.505.5374
SMILESCOc1cc(O[C@H](C)c2ccncc2)c(F)cc1C(=O)N1CCC(CC1)N1C(=O)OCc2ccccc12