Reaction Details
TargetKappa-type opioid receptor
LigandBDBM50072452
Substrate/Competitorn/a
Meas. Tech.ChEMBL_146523 (CHEMBL754631)
Ki 9.8±n/a nM
Citation Thomas, JBMascarella, SWBurgess, JPXu, HMcCullough, KBRothman, RBFlippen-Anderson, JLGeorge, CFCantrell, BEZimmerman, DMCarroll, FI N-substituted octahydro-4a-(3-hydroxyphenyl)-10a-methyl-benzo[g]isoquinolines are opioid receptor pure antagonists. Bioorg Med Chem Lett8:3149-52 (1999) Kappa-type opioid receptor
Name:Kappa-type opioid receptor
Type:G Protein-Coupled Receptor (GPCR)
Mol. Mass.:42744.99
Organism:Cavia porcellus (domestic guinea pig)
Description:P41144
Residue:380
BDBM50072452
NameBDBM50072452
Synonyms:3-((4aS,10aS)-10a-Methyl-2-phenethyl-1,3,4,5,10,10a-hexahydro-2H-benzo[g]isoquinolin-4a-yl)-phenol | CHEMBL107398
TypeSmall organic molecule
Emp. Form.C28H31NO
Mol. Mass.397.5518
SMILESC[C@@]12CN(CCc3ccccc3)CC[C@@]1(Cc1ccccc1C2)c1cccc(O)c1