Reaction Details
TargetIntegrin alpha-V/beta-3
LigandBDBM50072491
Substrate/Competitorn/a
Meas. Tech.ChEMBL_226600 (CHEMBL874106)
Ki 9±n/a nM
Citation Keenan, RMMiller, WHLago, MAAli, FEBondinell, WECallahan, JFCalvo, RRCousins, RDHwang, SMJakas, DRKu, TWKwon, CNguyen, TTReader, VARieman, DJRoss, STTakata, DTUzinskas, INYuan, CCSmith, BR Benzimidazole derivatives as arginine mimetics in 1,4-benzodiazepine nonpeptide vitronectin receptor (alpha v beta 3) antagonists. Bioorg Med Chem Lett8:3165-70 (1999) Integrin alpha-V/beta-3
Name:Integrin alpha-V/beta-3
Type:Enzyme
Mol. Mass.:n/a
Description:n/a
Components:This complex has 2 components.
Component 1
Name:Integrin alpha-V
Synonyms:ITAV_HUMAN Integrin alpha-V/alpha-5 VNRA Vitronectin receptor | Vitronectin receptor subunit alpha
Type:PROTEIN
Mol. Mass.:116024.92
Organism:Homo sapiens (Human)
Description:ChEMBL_582336
Residue:1048
Component 2
Name:Integrin beta-3
Synonyms:CD_antigen=CD61 GPIIIa ITGB3 Platelet membrane glycoprotein IIIa
Type:Protein
Mol. Mass.:87038.91
Organism:Homo sapiens (Human)
Description:P05106
Residue:788
BDBM50072491
NameBDBM50072491
Synonyms:CHEMBL325548 | {(S)-7-[(1H-Benzoimidazol-2-ylmethyl)-carbamoyl]-3-oxo-4-phenethyl-2,3,4,5-tetrahydro-1H-benzo[e][1,4]diazepin-2-yl}-acetic acid
TypeSmall organic molecule
Emp. Form.C28H27N5O4
Mol. Mass.497.5451
SMILESOC(=O)C[C@@H]1Nc2ccc(cc2CN(CCc2ccccc2)C1=O)C(=O)NCc1nc2ccccc2[nH]1