Reaction Details
TargetIntegrin alpha-V/beta-3
LigandBDBM50072466
Substrate/Competitorn/a
Meas. Tech.ChEMBL_226600 (CHEMBL874106)
Ki 5±n/a nM
Citation Keenan, RMMiller, WHLago, MAAli, FEBondinell, WECallahan, JFCalvo, RRCousins, RDHwang, SMJakas, DRKu, TWKwon, CNguyen, TTReader, VARieman, DJRoss, STTakata, DTUzinskas, INYuan, CCSmith, BR Benzimidazole derivatives as arginine mimetics in 1,4-benzodiazepine nonpeptide vitronectin receptor (alpha v beta 3) antagonists. Bioorg Med Chem Lett8:3165-70 (1999) Integrin alpha-V/beta-3
Name:Integrin alpha-V/beta-3
Type:Enzyme
Mol. Mass.:n/a
Description:n/a
Components:This complex has 2 components.
Component 1
Name:Integrin alpha-V
Synonyms:ITAV_HUMAN Integrin alpha-V/alpha-5 VNRA Vitronectin receptor | Vitronectin receptor subunit alpha
Type:PROTEIN
Mol. Mass.:116024.92
Organism:Homo sapiens (Human)
Description:ChEMBL_582336
Residue:1048
Component 2
Name:Integrin beta-3
Synonyms:CD_antigen=CD61 GPIIIa ITGB3 Platelet membrane glycoprotein IIIa
Type:Protein
Mol. Mass.:87038.91
Organism:Homo sapiens (Human)
Description:P05106
Residue:788
BDBM50072466
NameBDBM50072466
Synonyms:CHEMBL106763 | {(S)-4-Methyl-7-[methyl-(4,5,6,7-tetrahydro-1H-benzoimidazol-2-ylmethyl)-carbamoyl]-3-oxo-2,3,4,5-tetrahydro-1H-benzo[e][1,4]diazepin-2-yl}-acetic acid
TypeSmall organic molecule
Emp. Form.C22H27N5O4
Mol. Mass.425.4809
SMILESCN(Cc1nc2CCCCc2[nH]1)C(=O)c1ccc2N[C@@H](CC(O)=O)C(=O)N(C)Cc2c1