Reaction Details
TargetProthrombin
LigandBDBM50072539
Substrate/Competitorn/a
Meas. Tech.ChEBML_225581
Ki 24±n/a nM
Citation St-Denis, YAugelli-Szafran, CEBachand, BBerryman, KADiMaio, JDoherty, AMEdmunds, JJLeblond, LLévesque, SNarasimhan, LSPenvose-Yi, JRRubin, JRTarazi, MWinocour, PDSiddiqui, MA Potent bicyclic lactam inhibitors of thrombin: Part I: P3 modifications. Bioorg Med Chem Lett8:3193-8 (1999) Prothrombin
Name:Prothrombin
Type:Protein
Mol. Mass.:70029.57
Organism:Homo sapiens (Human)
Description:P00734
Residue:622
BDBM50072539
NameBDBM50072539
Synonyms:(6S,8aS)-2-(3-Cyclohexyl-propionyl)-4-oxo-octahydro-pyrrolo[1,2-a]pyrazine-6-carboxylic acid [4-guanidino-1-(thiazole-2-carbonyl)-butyl]-amide | CHEMBL111043
TypeSmall organic molecule
Emp. Form.C26H39N7O4S
Mol. Mass.545.697
SMILESNC(=N)NCCCC(NC(=O)[C@@H]1CC[C@H]2CN(CC(=O)N12)C(=O)CCC1CCCCC1)C(=O)c1nccs1