Reaction Details
TargetInterstitial collagenase
LigandBDBM50072583
Substrate/Competitorn/a
Meas. Tech.ChEBML_102119
IC50 0.260000±n/a nM
Citation Sheppard, GSFlorjancic, ASGiesler, JRXu, LGuo, YDavidsen, SKMarcotte, PAElmore, IAlbert, DHMagoc, TJBouska, JJGoodfellow, CLMorgan, DWSummers, JB Aryl ketones as novel replacements for the C-terminal amide bond of succinyl hydroxamate MMP inhibitors. Bioorg Med Chem Lett8:3251-6 (1999) Interstitial collagenase
Name:Interstitial collagenase
Type:Enzyme
Mol. Mass.:54010.26
Organism:Homo sapiens (Human)
Description: P03956
Residue:469
BDBM50072583
NameBDBM50072583
Synonyms:(2R,3S)-2,N*1*-Dihydroxy-N*4*-[(S)-1-(1H-indole-3-carbonyl)-2,2-dimethyl-propyl]-3-isobutyl-succinamide | CHEMBL321180
TypeSmall organic molecule
Emp. Form.C22H31N3O5
Mol. Mass.417.4986
SMILESCC(C)C[C@H]([C@H](O)C(=O)NO)C(=O)N[C@H](C(=O)c1c[nH]c2ccccc12)C(C)(C)C