Reaction Details
TargetMelatonin receptor type 1B
LigandBDBM50072658
Substrate/Competitorn/a
Meas. Tech.ChEBML_219514
Ki 40±n/a nM
Citation Kloubert, SMathé-Allainmat, MAndrieux, JSicsic, SLanglois, M Synthesis of benzocycloalkane derivatives as new conformationally restricted ligands for melatonin receptors. Bioorg Med Chem Lett8:3325-30 (1999) Melatonin receptor type 1B
Name:Melatonin receptor type 1B
Type:Enzyme Catalytic Domain
Mol. Mass.:33012.73
Organism:Chick
Description:Melatonin 0 Chick::P51050
Residue:289
BDBM50072658
NameBDBM50072658
Synonyms:CHEMBL114929 | N-(4-Methoxy-bicyclo[4.2.0]octa-1,3,5-trien-7-ylmethyl)-propionamide
TypeSmall organic molecule
Emp. Form.C13H17NO2
Mol. Mass.219.2796
SMILESCCC(=O)NCC1Cc2ccc(OC)cc12