Reaction Details
TargetMelatonin receptor type 1B
LigandBDBM50072652
Substrate/Competitorn/a
Meas. Tech.ChEMBL_219514 (CHEMBL824491)
Ki 16.0±n/a nM
Citation Kloubert, SMathé-Allainmat, MAndrieux, JSicsic, SLanglois, M Synthesis of benzocycloalkane derivatives as new conformationally restricted ligands for melatonin receptors. Bioorg Med Chem Lett8:3325-30 (1999) Melatonin receptor type 1B
Name:Melatonin receptor type 1B
Type:Enzyme Catalytic Domain
Mol. Mass.:33012.73
Organism:Chick
Description:Melatonin 0 Chick::P51050
Residue:289
BDBM50072652
NameBDBM50072652
Synonyms:CHEMBL113244 | N-(6-Methoxy-indan-1-ylmethyl)-propionamide
TypeSmall organic molecule
Emp. Form.C14H19NO2
Mol. Mass.233.3062
SMILESCCC(=O)NCC1CCc2ccc(OC)cc12