Reaction Details
TargetBeta-1,4-galactosyltransferase 1
LigandBDBM50072689
Substrate/Competitorn/a
Meas. Tech.ChEBML_218108
Ki 9500±n/a nM
Citation Chung, SJTakayama, SWong, CH Acceptor substrate-based selective inhibition of galactosyltransferases. Bioorg Med Chem Lett8:3359-64 (1999) Beta-1,4-galactosyltransferase 1
Name:Beta-1,4-galactosyltransferase 1
Type:Enzyme
Mol. Mass.:44860.74
Organism:Bos taurus (Cattle)
Description:P08037
Residue:402
BDBM50072689
NameBDBM50072689
Synonyms:CHEMBL112241 | N-[4,5-Dihydroxy-6-hydroxymethyl-2-(naphthalen-2-yloxy)-tetrahydro-pyran-3-yl]-acetamide
TypeSmall organic molecule
Emp. Form.C18H21NO6
Mol. Mass.347.3624
SMILESCC(=O)NC1C(O)C(O)C(CO)OC1Oc1ccc2ccccc2c1