Reaction Details
TargetCannabinoid receptor 1
LigandBDBM50072758
Substrate/Competitorn/a
Meas. Tech.ChEMBL_46801 (CHEMBL659688)
Ki 379±n/a nM
Citation Lin, SKhanolkar, ADFan, PGoutopoulos, AQin, CPapahadjis, DMakriyannis, A Novel analogues of arachidonylethanolamide (anandamide): affinities for the CB1 and CB2 cannabinoid receptors and metabolic stability. J Med Chem41:5353-61 (1999) 
 
Cannabinoid receptor 1
Name:Cannabinoid receptor 1
Type:G Protein-Coupled Receptor (GPCR)
Mol. Mass.:52856.55
Organism:Rattus norvegicus (rat)
Description:P20272
Residue:473
BDBM50072758
NameBDBM50072758
Synonyms:(5Z,8Z,11Z,14Z)-Icosa-5,8,11,14-tetraenoic acid ((S)-sec-butyl)-amide | CHEMBL151862
TypeSmall organic molecule
Emp. Form.C24H41NO
Mol. Mass.359.5884
SMILESCCCCC\C=C/C\C=C/C\C=C/C\C=C/CCCC(=O)N[C@@H](C)CC