Reaction Details
TargetTissue-type plasminogen activator
LigandBDBM50072843
Substrate/Competitorn/a
Meas. Tech.ChEMBL_208239 (CHEMBL815718)
Ki 35±n/a nM
Citation Renatus, MBode, WHuber, RStürzebecher, JStubbs, MT Structural and functional analyses of benzamidine-based inhibitors in complex with trypsin: implications for the inhibition of factor Xa, tPA, and urokinase. J Med Chem41:5445-56 (1999) 
 
Tissue-type plasminogen activator
Name:Tissue-type plasminogen activator
Type:Enzyme
Mol. Mass.:62931.08
Organism:Homo sapiens (Human)
Description:n/a
Residue:562
BDBM50072843
NameBDBM50072843
Synonyms:2,7-Bis-(4-diaminomethyl-benzylidene)-cycloheptanone | CHEMBL357079
TypeSmall organic molecule
Emp. Form.C23H28N4O
Mol. Mass.376.4946
SMILESNC(N)c1ccc(\C=C2/CCCC\C(=C/c3ccc(cc3)C(N)N)C2=O)cc1