Reaction Details
TargetProthrombin
LigandBDBM50038002
Substrate/Competitorn/a
Meas. Tech.ChEMBL_210594 (CHEMBL816561)
Ki 890000±n/a nM
Citation Renatus, MBode, WHuber, RStürzebecher, JStubbs, MT Structural and functional analyses of benzamidine-based inhibitors in complex with trypsin: implications for the inhibition of factor Xa, tPA, and urokinase. J Med Chem41:5445-56 (1999) 
 
Prothrombin
Name:Prothrombin
Type:Enzyme
Mol. Mass.:70502.73
Organism:Bos taurus (Bovine)
Description:P00735
Residue:625
BDBM50038002
NameBDBM50038002
Synonyms:Benzamidine (Protonated) CHEMBL537204 | benzamidine
TypeSmall organic molecule
Emp. Form.C7H8N2
Mol. Mass.120.1518
SMILESNC(=N)c1ccccc1