Reaction Details
TargetAlpha-1A adrenergic receptor
LigandBDBM50073027
Substrate/Competitorn/a
Meas. Tech.ChEMBL_33748 (CHEMBL647825)
Ki 5.93±n/a nM
Citation Barlocco, DCignarella, GMontesano, FLeonardi, AMella, MToma, L Novel adrenoceptor antagonists with a tricyclic pyrrolodipyridazine skeleton. J Med Chem42:173-7 (1999) 
 
Alpha-1A adrenergic receptor
Name:Alpha-1A adrenergic receptor
Type:Cell-surface receptors
Mol. Mass.:51511.67
Organism:Homo sapiens (Human)
Description:P35348
Residue:466
BDBM50073027
NameBDBM50073027
Synonyms:8-Chloro-2-{2-[4-(2-chloro-phenyl)-piperazin-1-yl]-ethylamino}-6-methyl-6H-1,6,7,9a-tetraaza-fluoren-5-one | CHEMBL49851
TypeSmall organic molecule
Emp. Form.C22H23Cl2N7O
Mol. Mass.472.37
SMILESCn1nc(Cl)c2cn3nc(NCCN4CCN(CC4)c4ccccc4Cl)ccc3c2c1=O