Reaction Details
TargetAlpha-1D adrenergic receptor
LigandBDBM29568
Substrate/Competitorn/a
Meas. Tech.ChEMBL_32458 (CHEMBL643574)
Ki 0.29±n/a nM
Citation Barlocco, DCignarella, GMontesano, FLeonardi, AMella, MToma, L Novel adrenoceptor antagonists with a tricyclic pyrrolodipyridazine skeleton. J Med Chem42:173-7 (1999) 
 
Alpha-1D adrenergic receptor
Name:Alpha-1D adrenergic receptor
Type:Enzyme Catalytic Domain
Mol. Mass.:60485.82
Organism:Homo sapiens (Human)
Description:adrenergic Alpha1D ADRA1D HUMAN::P25100
Residue:572
BDBM29568
NameBDBM29568
Synonyms:CHEMBL2 PRAZOSIN HYDROCHLORIDE [3H]-Minipress [3H]-Prazosin
Typeradiolabeled ligand
Emp. Form.C19H21N5O4
Mol. Mass.383.4011
SMILESCOc1cc2nc(nc(N)c2cc1OC)N1CCN(CC1)C(=O)c1ccco1