Reaction Details
TargetCytochrome P450 2C19
LigandBDBM50073056
Substrate/Competitorn/a
Meas. Tech.ChEMBL_52552 (CHEMBL666251)
IC50 46000±n/a nM
Citation Bromidge, SMBrown, AMClarke, SEDodgson, KGager, TGrassam, HLJeffrey, PMJoiner, GFKing, FDMiddlemiss, DNMoss, SFNewman, HRiley, GRoutledge, CWyman, P 5-Chloro-N-(4-methoxy-3-piperazin-1-yl- phenyl)-3-methyl-2-benzothiophenesulfon- amide (SB-271046): a potent, selective, and orally bioavailable 5-HT6 receptor antagonist. J Med Chem42:202-5 (1999) 
 
Cytochrome P450 2C19
Name:Cytochrome P450 2C19
Type:Enzyme
Mol. Mass.:55935.47
Organism:Homo sapiens (Human)
Description:P33261
Residue:490
BDBM50073056
NameBDBM50073056
Synonyms:4-Bromo-N-[4-methoxy-3-(4-methyl-piperazin-1-yl)-phenyl]-benzenesulfonamide SB-214111
TypeSmall organic molecule
Emp. Form.C18H22BrN3O3S
Mol. Mass.440.355
SMILESCOc1ccc(NS(=O)(=O)c2ccc(Br)cc2)cc1N1CCN(C)CC1