Reaction Details
TargetChymotrypsinogen B
LigandBDBM50073133
Substrate/Competitorn/a
Meas. Tech.ChEMBL_216467 (CHEMBL818537)
IC50 1500±n/a nM
Citation Iijima, KKatada, JYasuda, EUno, IHayashi, Y N-[2,2-dimethyl-3-(N-(4-cyanobenzoyl)amino)nonanoyl]-L-phenylalanine ethyl ester as a stable ester-type inhibitor of chymotrypsin-like serine proteases: structural requirements for potent inhibition of alpha-chymotrypsin. J Med Chem42:312-23 (1999) 
 
Chymotrypsinogen B
Name:Chymotrypsinogen B
Type:PROTEIN
Mol. Mass.:25751.02
Organism:Bos taurus
Description:ChEMBL_216467
Residue:245
BDBM50073133
NameBDBM50073133
Synonyms:(S)-2-[3-(3,5-Difluoro-benzoylamino)-2,2-dimethyl-nonanoylamino]-3-phenyl-propionic acid ethyl ester | CHEMBL108931
TypeSmall organic molecule
Emp. Form.C29H38F2N2O4
Mol. Mass.516.6198
SMILESCCCCCCC(NC(=O)c1cc(F)cc(F)c1)C(C)(C)C(=O)N[C@@H](Cc1ccccc1)C(=O)OCC