Reaction Details
TargetChymotrypsinogen B
LigandBDBM50073137
Substrate/Competitorn/a
Meas. Tech.ChEMBL_216467 (CHEMBL818537)
IC50 3400±n/a nM
Citation Iijima, KKatada, JYasuda, EUno, IHayashi, Y N-[2,2-dimethyl-3-(N-(4-cyanobenzoyl)amino)nonanoyl]-L-phenylalanine ethyl ester as a stable ester-type inhibitor of chymotrypsin-like serine proteases: structural requirements for potent inhibition of alpha-chymotrypsin. J Med Chem42:312-23 (1999) 
 
Chymotrypsinogen B
Name:Chymotrypsinogen B
Type:PROTEIN
Mol. Mass.:25751.02
Organism:Bos taurus
Description:ChEMBL_216467
Residue:245
BDBM50073137
NameBDBM50073137
Synonyms:(S)-2-[3-(4-Cyano-benzoylamino)-2,2-dimethyl-pentanoylamino]-3-phenyl-propionic acid ethyl ester | CHEMBL109291
TypeSmall organic molecule
Emp. Form.C26H31N3O4
Mol. Mass.449.542
SMILESCCOC(=O)[C@H](Cc1ccccc1)NC(=O)C(C)(C)C(CC)NC(=O)c1ccc(cc1)C#N