Reaction Details
TargetChymotrypsinogen B
LigandBDBM50073139
Substrate/Competitorn/a
Meas. Tech.ChEMBL_216467 (CHEMBL818537)
IC50 2.1±n/a nM
Citation Iijima, KKatada, JYasuda, EUno, IHayashi, Y N-[2,2-dimethyl-3-(N-(4-cyanobenzoyl)amino)nonanoyl]-L-phenylalanine ethyl ester as a stable ester-type inhibitor of chymotrypsin-like serine proteases: structural requirements for potent inhibition of alpha-chymotrypsin. J Med Chem42:312-23 (1999) 
 
Chymotrypsinogen B
Name:Chymotrypsinogen B
Type:PROTEIN
Mol. Mass.:25751.02
Organism:Bos taurus
Description:ChEMBL_216467
Residue:245
BDBM50073139
NameBDBM50073139
Synonyms:2-(4-cyanophenylcarboxamido)-1,1-dimethyl-4-phenylpentanoic anhydride [2,2-dimethyl-3-(N-(4-cyanobenzoyl)aminoi)-5-phenylpentanoic anhydride]
TypeSmall organic molecule
Emp. Form.C42H42N4O5
Mol. Mass.682.8067
SMILESCC(C)(C(CCc1ccccc1)NC(=O)c1ccc(cc1)C#N)C(=O)OC(=O)C(C)(C)C(CCc1ccccc1)NC(=O)c1ccc(cc1)C#N