Reaction Details
TargetChymotrypsinogen B
LigandBDBM50073123
Substrate/Competitorn/a
Meas. Tech.ChEMBL_216467 (CHEMBL818537)
IC50 1.60±n/a nM
Citation Iijima, KKatada, JYasuda, EUno, IHayashi, Y N-[2,2-dimethyl-3-(N-(4-cyanobenzoyl)amino)nonanoyl]-L-phenylalanine ethyl ester as a stable ester-type inhibitor of chymotrypsin-like serine proteases: structural requirements for potent inhibition of alpha-chymotrypsin. J Med Chem42:312-23 (1999) 
 
Chymotrypsinogen B
Name:Chymotrypsinogen B
Type:PROTEIN
Mol. Mass.:25751.02
Organism:Bos taurus
Description:ChEMBL_216467
Residue:245
BDBM50073123
NameBDBM50073123
Synonyms:(S)-2-[3-(4-Cyano-benzoylamino)-2,2-dimethyl-nonanoylamino]-3-phenyl-propionic acid ethyl ester | CHEMBL108294
TypeSmall organic molecule
Emp. Form.C30H39N3O4
Mol. Mass.505.6484
SMILESCCCCCCC(NC(=O)c1ccc(cc1)C#N)C(C)(C)C(=O)N[C@@H](Cc1ccccc1)C(=O)OCC