Reaction Details
Target4-aminobutyrate aminotransferase, mitochondrial
LigandBDBM50082127
Substrate/Competitorn/a
Meas. Tech.ChEMBL_70660 (CHEMBL678650)
Ki 6300000±n/a nM
Citation Qiu, JStevenson, SHO'Beirne, MJSilverman, RB 2,6-Difluorophenol as a bioisostere of a carboxylic acid: bioisosteric analogues of gamma-aminobutyric acid. J Med Chem42:329-32 (1999) 
 
4-aminobutyrate aminotransferase, mitochondrial
Name:4-aminobutyrate aminotransferase, mitochondrial
Type:n/a
Mol. Mass.:56633.06
Organism:Sus scrofa
Description:n/a
Residue:500
BDBM50082127
NameBDBM50082127
Synonyms:3-(ammoniomethyl)-2,6-difluorobenzenolate CHEMBL321931
TypeSmall organic molecule
Emp. Form.C7H7F2NO
Mol. Mass.159.1334
SMILES[NH3+]Cc1ccc(F)c([O-])c1F