Reaction Details
TargetD(3) dopamine receptor
LigandBDBM50073273
Substrate/Competitorn/a
Meas. Tech.ChEBML_62283
Ki 45±n/a nM
Citation Terán, CSantana, LUriarte, EFall, YUnelius, LTolf, BR Phenylpiperazine derivatives with strong affinity for 5HT1A, D2A and D3 receptors. Bioorg Med Chem Lett8:3567-70 (1999) D(3) dopamine receptor
Name:D(3) dopamine receptor
Type:n/a
Mol. Mass.:44243.43
Organism:Homo sapiens (Human)
Description:n/a
Residue:400
BDBM50073273
NameBDBM50073273
Synonyms:3,4-Dimethyl-7-[3-(4-phenyl-piperazin-1-yl)-propoxy]-chromen-2-one | CHEMBL120661
TypeSmall organic molecule
Emp. Form.C24H28N2O3
Mol. Mass.392.4907
SMILESCc1c(C)c(=O)oc2cc(OCCCN3CCN(CC3)c3ccccc3)ccc12