Reaction Details
Target5-hydroxytryptamine receptor 1A
LigandBDBM50073274
Substrate/Competitorn/a
Meas. Tech.ChEBML_201038
Ki 0.790000±n/a nM
Citation Terán, CSantana, LUriarte, EFall, YUnelius, LTolf, BR Phenylpiperazine derivatives with strong affinity for 5HT1A, D2A and D3 receptors. Bioorg Med Chem Lett8:3567-70 (1999) 5-hydroxytryptamine receptor 1A
Name:5-hydroxytryptamine receptor 1A
Type:G Protein-Coupled Receptor (GPCR)
Mol. Mass.:46445.29
Organism:Rattus norvegicus (rat)
Description:Binding assays were performed using rat hippocampal membranes.
Residue:422
BDBM50073274
NameBDBM50073274
Synonyms:3-Methyl-7-[3-(4-phenyl-piperazin-1-yl)-propoxy]-chromen-2-one | CHEMBL422788
TypeSmall organic molecule
Emp. Form.C23H26N2O3
Mol. Mass.378.4641
SMILESCc1cc2ccc(OCCCN3CCN(CC3)c3ccccc3)cc2oc1=O