Reaction Details
TargetProthrombin
LigandBDBM50073294
Substrate/Competitorn/a
Meas. Tech.ChEBML_208323
Ki 24±n/a nM
Citation Ambler, JBaker, EBrown, LButler, PFarr, DDunnet, KLe Grand, DJanus, DJones, DMenear, KMercer, MSmith, GTalbot, MTweed, M The discovery of orally available thrombin inhibitors: studies towards the optimisation of CGH1668. Bioorg Med Chem Lett8:3583-8 (1999) Prothrombin
Name:Prothrombin
Type:Protein
Mol. Mass.:70029.57
Organism:Homo sapiens (Human)
Description:P00734
Residue:622
BDBM50073294
NameBDBM50073294
Synonyms:4-((S)-1-Benzyl-2-dimethylamino-ethylamino)-pyridine-3-sulfonic acid {(S)-1-(4-amino-benzyl)-2-[4-(2-fluoro-ethyl)-piperidin-1-yl]-2-oxo-ethyl}-amide CHEMBL120871
TypeSmall organic molecule
Emp. Form.C32H43FN6O3S
Mol. Mass.610.786
SMILESCN(C)C[C@H](Cc1ccccc1)Nc1ccncc1S(=O)(=O)N[C@@H](Cc1ccc(N)cc1)C(=O)N1CCC(CCF)CC1