Reaction Details
TargetGag-Pol polyprotein [489-587]
LigandBDBM50073342
Substrate/Competitorn/a
Meas. Tech.ChEMBL_157537 (CHEMBL764922)
Ki 3400±n/a nM
Citation Baker, CTSalituro, FGCourt, JJDeininger, DDKim, EELi, BNovak, PMRao, BGPazhanisamy, SSchairer, WCTung, RD Design, synthesis, and conformational analysis of a novel series of HIV protease inhibitors. Bioorg Med Chem Lett8:3631-6 (1999) Gag-Pol polyprotein [489-587]
Name:Gag-Pol polyprotein [489-587]
Type:Enzyme Subunit
Mol. Mass.:10781.16
Organism:Human immunodeficiency virus type 1
Description:P04585[489-587]
Residue:99
BDBM50073342
NameBDBM50073342
Synonyms:CHEMBL121375 | N-Cyclopentylmethyl-N-[(S)-2-hydroxy-3-(3-methyl-1-phenethyl-ureido)-propyl]-4-methoxy-benzenesulfonamide
TypeSmall organic molecule
Emp. Form.C26H37N3O5S
Mol. Mass.503.654
SMILESCNC(=O)N(CCc1ccccc1)C[C@H](O)CN(CC1CCCC1)S(=O)(=O)c1ccc(OC)cc1