Reaction Details
TargetGag-Pol polyprotein [489-587]
LigandBDBM50073344
Substrate/Competitorn/a
Meas. Tech.ChEMBL_157537 (CHEMBL764922)
Ki>10000±n/a nM
Citation Baker, CTSalituro, FGCourt, JJDeininger, DDKim, EELi, BNovak, PMRao, BGPazhanisamy, SSchairer, WCTung, RD Design, synthesis, and conformational analysis of a novel series of HIV protease inhibitors. Bioorg Med Chem Lett8:3631-6 (1999) Gag-Pol polyprotein [489-587]
Name:Gag-Pol polyprotein [489-587]
Type:Enzyme Subunit
Mol. Mass.:10781.16
Organism:Human immunodeficiency virus type 1
Description:P04585[489-587]
Residue:99
BDBM50073344
NameBDBM50073344
Synonyms:CHEMBL331655 | N-Cyclopentylmethyl-N-{(S)-2-hydroxy-3-[3-(3-methoxy-phenyl)-1-phenethyl-ureido]-propyl}-4-methoxy-benzenesulfonamide
TypeSmall organic molecule
Emp. Form.C32H41N3O6S
Mol. Mass.595.749
SMILESCOc1ccc(cc1)S(=O)(=O)N(C[C@@H](O)CN(CCc1ccccc1)C(=O)Nc1cccc(OC)c1)CC1CCCC1