Reaction Details
TargetGag-Pol polyprotein [489-587]
LigandBDBM50073356
Substrate/Competitorn/a
Meas. Tech.ChEBML_157537
Ki 27±n/a nM
Citation Baker, CTSalituro, FGCourt, JJDeininger, DDKim, EELi, BNovak, PMRao, BGPazhanisamy, SSchairer, WCTung, RD Design, synthesis, and conformational analysis of a novel series of HIV protease inhibitors. Bioorg Med Chem Lett8:3631-6 (1999) Gag-Pol polyprotein [489-587]
Name:Gag-Pol polyprotein [489-587]
Type:Enzyme Subunit
Mol. Mass.:10781.16
Organism:Human immunodeficiency virus type 1
Description:P04585[489-587]
Residue:99
BDBM50073356
NameBDBM50073356
Synonyms:1N-[3-cyclopentylmethyl(4-methoxyphenyl)sulfonamido-2-hydroxy-(2S)-propyl]-1N-phenethyl-2-(3-aminosulfonamido-4-pyridyl)acetamide | CHEMBL431655
TypeSmall organic molecule
Emp. Form.C31H41N5O7S2
Mol. Mass.659.817
SMILESCOc1ccc(cc1)S(=O)(=O)N(C[C@@H](O)CN(CCc1ccccc1)C(=O)Cc1ccncc1NS(N)(=O)=O)CC1CCCC1