Reaction Details
TargetGag-Pol polyprotein [489-587]
LigandBDBM50073369
Substrate/Competitorn/a
Meas. Tech.ChEBML_157552
Ki 17±n/a nM
Citation Salituro, FGBaker, CTCourt, JJDeininger, DDKim, EELi, BNovak, PMRao, BGPazhanisamy, SPorter, MDSchairer, WCTung, RD Design and synthesis of novel conformationally restricted HIV protease inhibitors. Bioorg Med Chem Lett8:3637-42 (1999) Gag-Pol polyprotein [489-587]
Name:Gag-Pol polyprotein [489-587]
Type:Enzyme Subunit
Mol. Mass.:10781.16
Organism:Human immunodeficiency virus type 1
Description:P04585[489-587]
Residue:99
BDBM50073369
NameBDBM50073369
Synonyms:CHEMBL433187 | N-[(S)-3-((S)-3-Benzyl-5-oxo-1,4-diaza-spiro[5.5]undec-4-yl)-2-hydroxy-propyl]-N-cyclopentylmethyl-4-methoxy-benzenesulfonamide
TypeSmall organic molecule
Emp. Form.C32H45N3O5S
Mol. Mass.583.782
SMILESCOc1ccc(cc1)S(=O)(=O)N(C[C@@H](O)CN1[C@@H](Cc2ccccc2)CNC2(CCCCC2)C1=O)CC1CCCC1