Reaction Details
TargetCapsid scaffolding protein
LigandBDBM50073419
Substrate/Competitorn/a
Meas. Tech.ChEBML_158972
IC50 60±n/a nM
Citation Dhanak, DKeenan, RMBurton, GKaura, ADarcy, MGShah, DHRidgers, LHBreen, ALavery, PTew, DGWest, A Benzothiopyran-4-one based reversible inhibitors of the human cytomegalovirus (HCMV) protease. Bioorg Med Chem Lett8:3677-82 (1999) Capsid scaffolding protein
Name:Capsid scaffolding protein
Type:PROTEIN
Mol. Mass.:73854.16
Organism:Human cytomegalovirus (strain AD169) (HHV-5) (Human herpesvirus 5)
Description:ChEMBL_158958
Residue:708
BDBM50073419
NameBDBM50073419
Synonyms:2-Biphenyl-4-yl-1,1-dioxo-1H-1lambda*6*-thiochromen-4-one | CHEMBL263745
TypeSmall organic molecule
Emp. Form.C21H14O3S
Mol. Mass.346.399
SMILESO=C1C=C(c2ccc(cc2)-c2ccccc2)S(=O)(=O)c2ccccc12