Reaction Details
TargetCapsid scaffolding protein
LigandBDBM50073422
Substrate/Competitorn/a
Meas. Tech.ChEBML_158972
IC50 60±n/a nM
Citation Dhanak, DKeenan, RMBurton, GKaura, ADarcy, MGShah, DHRidgers, LHBreen, ALavery, PTew, DGWest, A Benzothiopyran-4-one based reversible inhibitors of the human cytomegalovirus (HCMV) protease. Bioorg Med Chem Lett8:3677-82 (1999) Capsid scaffolding protein
Name:Capsid scaffolding protein
Type:PROTEIN
Mol. Mass.:73854.16
Organism:Human cytomegalovirus (strain AD169) (HHV-5) (Human herpesvirus 5)
Description:ChEMBL_158958
Residue:708
BDBM50073422
NameBDBM50073422
Synonyms:2-(4-Nitro-phenyl)-1,1-dioxo-1H-1lambda*6*-thiochromen-4-one | CHEMBL121931
TypeSmall organic molecule
Emp. Form.C15H9NO5S
Mol. Mass.315.301
SMILES[O-][N+](=O)c1ccc(cc1)C1=CC(=O)c2ccccc2S1(=O)=O