Reaction Details
TargetSodium-dependent dopamine transporter
LigandBDBM81987
Substrate/Competitorn/a
Meas. Tech.ChEMBL_62951 (CHEMBL675535)
Ki 23.5±n/a nM
Citation Oya, SKung, MPActon, PDMu, MHou, CKung, HF A new single-photon emission computed tomography imaging agent for serotonin transporters: [123I]IDAM, 5-iodo-2-((2-((dimethylamino)methyl)phenyl)thio)benzyl alcohol. J Med Chem42:333-5 (1999) 
 
Sodium-dependent dopamine transporter
Name:Sodium-dependent dopamine transporter
Type:Multi-pass membrane protein
Mol. Mass.:68497.11
Organism:Homo sapiens (Human)
Description:Q01959
Residue:620
BDBM81987
NameBDBM81987
Synonyms:CHEMBL116048 | McN-5652-15
TypeSmall organic molecule
Emp. Form.C19H21NS
Mol. Mass.295.442
SMILESCSc1ccc(cc1)C1CN2CCCC2c2ccccc12