Reaction Details
TargetSodium-dependent noradrenaline transporter
LigandBDBM81987
Substrate/Competitorn/a
Meas. Tech.ChEMBL_143134 (CHEMBL744178)
Ki 1.82±n/a nM
Citation Oya, SKung, MPActon, PDMu, MHou, CKung, HF A new single-photon emission computed tomography imaging agent for serotonin transporters: [123I]IDAM, 5-iodo-2-((2-((dimethylamino)methyl)phenyl)thio)benzyl alcohol. J Med Chem42:333-5 (1999) 
 
Sodium-dependent noradrenaline transporter
Name:Sodium-dependent noradrenaline transporter
Type:Multi-pass membrane protein
Mol. Mass.:69337.72
Organism:Homo sapiens (Human)
Description:P23975
Residue:617
BDBM81987
NameBDBM81987
Synonyms:CHEMBL116048 | McN-5652-15
TypeSmall organic molecule
Emp. Form.C19H21NS
Mol. Mass.295.442
SMILESCSc1ccc(cc1)C1CN2CCCC2c2ccccc12