Reaction Details
Target5-hydroxytryptamine receptor 1D
LigandBDBM50073685
Substrate/Competitorn/a
Meas. Tech.ChEMBL_1728 (CHEMBL616933)
Ki 6.2±n/a nM
Citation Xu, YCSchaus, JMWalker, CKrushinski, JAdham, NZgombick, JMLiang, SXKohlman, DTAudia, JE N-Methyl-5-tert-butyltryptamine: A novel, highly potent 5-HT1D receptor agonist. J Med Chem42:526-31 (1999) 
 
5-hydroxytryptamine receptor 1D
Name:5-hydroxytryptamine receptor 1D
Type:G Protein-Coupled Receptor (GPCR)
Mol. Mass.:41920.63
Organism:Homo sapiens (Human)
Description:Receptor binding assays were performed using human clone stably expressed in CHO cells.
Residue:377
BDBM50073685
NameBDBM50073685
Synonyms:CHEMBL147454 | [2-(5-tert-Butyl-1H-indol-3-yl)-ethyl]-propyl-amine
TypeSmall organic molecule
Emp. Form.C17H26N2
Mol. Mass.258.4017
SMILESCCCNCCc1c[nH]c2ccc(cc12)C(C)(C)C