Reaction Details
Target5-hydroxytryptamine receptor 1A
LigandBDBM50073689
Substrate/Competitorn/a
Meas. Tech.ChEMBL_951 (CHEMBL616130)
Ki 62±n/a nM
Citation Xu, YCSchaus, JMWalker, CKrushinski, JAdham, NZgombick, JMLiang, SXKohlman, DTAudia, JE N-Methyl-5-tert-butyltryptamine: A novel, highly potent 5-HT1D receptor agonist. J Med Chem42:526-31 (1999) 
 
5-hydroxytryptamine receptor 1A
Name:5-hydroxytryptamine receptor 1A
Type:n/a
Mol. Mass.:46122.49
Organism:Homo sapiens (Human)
Description:n/a
Residue:422
BDBM50073689
NameBDBM50073689
Synonyms:(R)-6-Methylamino-6,7,8,9-tetrahydro-5H-carbazole-3-carboxylic acid amide FROVATRIPTAN | Frova
TypeSmall organic molecule
Emp. Form.C14H17N3O
Mol. Mass.243.3043
SMILESCN[C@@H]1CCc2[nH]c3ccc(cc3c2C1)C(N)=O