Reaction Details
TargetDihydrofolate reductase
LigandBDBM50073754
Substrate/Competitorn/a
Meas. Tech.ChEBML_54286
Ki 0.290000±n/a nM
Citation Gossett, LSHabeck, LLShackelford, KAMendelsohn, LGGates, SBWorzalla, JFSelf, TDTheobald, KSAndis, SLSchultz, RMShih, C The synthesis and biological activity of a series of 2,4-diaminopyrido[2,3-d]pyrimidine based antifolates as antineoplastic and antiarthritic agents. Bioorg Med Chem Lett9:75-8 (1999) Dihydrofolate reductase
Name:Dihydrofolate reductase
Type:Enzyme
Mol. Mass.:21453.99
Organism:Homo sapiens (Human)
Description:Recombinant human DHFR.
Residue:187
BDBM50073754
NameBDBM50073754
Synonyms:(R)-2-{4-[2-(2,4-Diamino-5,6,7,8-tetrahydro-pyrido[2,3-d]pyrimidin-6-yl)-ethyl]-benzoylamino}-2-methyl-pentanedioic acid LY-335518
TypeSmall organic molecule
Emp. Form.C22H28N6O5
Mol. Mass.456.4949
SMILESC[C@](CCC(O)=O)(NC(=O)c1ccc(CCC2CNc3nc(N)nc(N)c3C2)cc1)C(O)=O