Reaction Details
TargetCalpain-1 catalytic subunit
LigandBDBM50073850
Substrate/Competitorn/a
Meas. Tech.ChEBML_43477
Ki 10±n/a nM
Citation Angelastro, MRMarquart, ALMehdi, SKoehl, JRVaz, RJBey, PPeet, NP The synthesis of ketomethylene pseudopeptide analogues of dipeptide aldehyde inhibitors of calpain. Bioorg Med Chem Lett9:139-40 (1999) Calpain-1 catalytic subunit
Name:Calpain-1 catalytic subunit
Type:PROTEIN
Mol. Mass.:80319.95
Organism:Gallus gallus
Description:ChEMBL_43477
Residue:705
BDBM50073850
NameBDBM50073850
Synonyms:(S)-2-((S)-2-Benzyloxycarbonylamino-3-methyl-butyrylamino)-3-phenyl-propionic acid MDL-28170 [1-(1-Benzyl-2-oxo-ethylcarbamoyl)-2-methyl-propyl]-carbamic acid benzyl ester benzyl (2S)-3-methyl-1-oxo-1-(1-oxo-3-phenylpropan-2-ylamino)butan-2-ylcarbamate | benzyl (S)-3-methyl-1-oxo-1-(1-oxo-3-phenylpropan-2-ylamino)butan-2-ylcarbamate
TypeSmall organic molecule
Emp. Form.C22H26N2O4
Mol. Mass.382.4528
SMILESCC(C)[C@H](NC(=O)OCc1ccccc1)C(=O)NC(Cc1ccccc1)C=O