Reaction Details
TargetMatrix metalloproteinase-9
LigandBDBM50073885
Substrate/Competitorn/a
Meas. Tech.ChEBML_105232
IC50 14±n/a nM
Citation Fink, CACarlson, JEBoehm, CMcTaggart, PQiao, YDoughty, JGanu, VMelton, RGoldberg, R Design and synthesis of thiol containing inhibitors of matrix metalloproteinases. Bioorg Med Chem Lett9:195-200 (1999) Matrix metalloproteinase-9
Name:Matrix metalloproteinase-9
Type:n/a
Mol. Mass.:78603.01
Organism:Rattus norvegicus (Rat)
Description:P50282
Residue:708
BDBM50073885
NameBDBM50073885
Synonyms:4-Ethoxy-1-mercaptomethyl-cyclohexanecarboxylic acid [(S)-2-(4-hydroxy-phenyl)-1-phenylcarbamoyl-ethyl]-amide | CHEMBL291799
TypeSmall organic molecule
Emp. Form.C25H32N2O4S
Mol. Mass.456.598
SMILESCCO[C@H]1CC[C@](CS)(CC1)C(=O)N[C@@H](Cc1ccc(O)cc1)C(=O)Nc1ccccc1