Reaction Details
TargetAlpha-1A adrenergic receptor
LigandBDBM50074013
Substrate/Competitorn/a
Meas. Tech.ChEBML_33602
Ki 20±n/a nM
Citation Nerenberg, JBErb, JMBergman, JMO'Malley, SChang, RSScott, ALBroten, TPBock, MG 4-Oxospiro[benzopyran-2,4'-piperidines] as selective alpha 1a-adrenergic receptor antagonists. Bioorg Med Chem Lett9:291-4 (1999) Alpha-1A adrenergic receptor
Name:Alpha-1A adrenergic receptor
Type:Cell-surface receptors
Mol. Mass.:51511.67
Organism:Homo sapiens (Human)
Description:P35348
Residue:466
BDBM50074013
NameBDBM50074013
Synonyms:CHEMBL99614 | N-[1'-[2-(1-naphthyl)ethyl]-4-oxospiro[3,4-dihydro-2H-chromene-2,4'-(hexahydropyridine)]-7-yl]methanesulfonamide
TypeSmall organic molecule
Emp. Form.C26H28N2O4S
Mol. Mass.464.577
SMILESCS(=O)(=O)Nc1ccc2C(=O)CC3(CCN(CCc4cccc5ccccc45)CC3)Oc2c1