Reaction Details
TargetIntegrin alpha-IIb/beta-3
LigandBDBM50074035
Substrate/Competitorn/a
Meas. Tech.ChEMBL_70312 (CHEMBL678017)
Ki 1.5±n/a nM
Citation Keenan, RMCallahan, JFSamanen, JMBondinell, WECalvo, RRChen, LDeBrosse, CEggleston, DSHaltiwanger, RCHwang, SMJakas, DRKu, TWMiller, WHNewlander, KANichols, AParker, MFSouthhall, LSUzinskas, IVasko-Moser, JAVenslavsky, JWWong, ASHuffman, WF Conformational preferences in a benzodiazepine series of potent nonpeptide fibrinogen receptor antagonists. J Med Chem42:545-59 (1999) 
 
Integrin alpha-IIb/beta-3
Name:Integrin alpha-IIb/beta-3
Synonyms:Glycoprotein IIb/IIIa
Type:n/a
Mol. Mass.:n/a
Description:ASSAY_ID of EBI is 30109
Components:This complex has 2 components.
Component 1
Name:Integrin beta-3
Type:Protein
Mol. Mass.:87038.91
Organism:Homo sapiens (Human)
Description:P05106
Residue:788
Component 2
Name:Integrin alpha-IIb
Synonyms:CD_antigen=CD41 GPIIb Glycoprotein IIb ITGA2B Integrin alpha-IIb heavy chain Integrin alpha-IIb light chain, form 2 Integrin alpha-V/beta-3 and alpha-IIb/beta 3 | Platelet membrane glycoprotein IIb
Type:Protein
Mol. Mass.:113354.85
Organism:Homo sapiens (Human)
Description:P08514
Residue:1039
BDBM50074035
NameBDBM50074035
Synonyms:CHEMBL82980 | {7-[(4-Carbamimidoyl-phenyl)-methyl-carbamoyl]-3-oxo-2-phenethyl-2,3,4,5-tetrahydro-1H-benzo[c]azepin-4-yl}-acetic acid
TypeSmall organic molecule
Emp. Form.C29H30N4O4
Mol. Mass.498.5729
SMILESCN(C(=O)c1ccc2CN(CCc3ccccc3)C(=O)C(CC(O)=O)Cc2c1)c1ccc(cc1)C(N)=N